# Build failed - webos OSE 2.7.0

**URL:** <https://forum.webosose.org/t/build-failed-webos-ose-2-7-0/1221>\
**Category:** Platform Development\
**Created:** [October 5, 2020, 12:49am UTC](https://forum.webosose.org/t/build-failed-webos-ose-2-7-0/1221 "2020-10-05T00:49:30Z")\
**Posts on this page:** 4\
**Page:** 1

<div class="post-metadata">

**Author:** ![youngyun](https://yyz1.discourse-cdn.com/flex031/user_avatar/forum.webosose.org/youngyun/32/377_2.png) [@youngyun](https://forum.webosose.org/u/youngyun)\
**Post date:** [October 5, 2020, 12:49am UTC](https://forum.webosose.org/t/build-failed-webos-ose-2-7-0/1221/1 "2020-10-05T00:49:30Z")

</div>

Hi.

I got some error for building on webos OSE 2.7.0  
Please let me know how to solve it.

Thank you.

> **FAILED: src/libluna-service2++/test/test\_category**  
> : && /home/youngyunkim/00\_webos/20201005/build-webos/BUILD/work/raspberrypi4-webos-linux-gnueabi/luna-service2/3.21.2-6-r25/recipe-sysroot-native/usr/bin/arm-webos-linux-gnueabi/arm-webos-linux-gnueabi-g++ -mthumb -mfpu=neon-vfpv4 -mfloat-abi=hard -mcpu=cortex-a7 -fstack-protector-strong -D\_FORTIFY\_SOURCE=2 -Wformat -Wformat-security -Werror=format-security -Werror=return-type --sysroot=/home/youngyunkim/00\_webos/20201005/build-webos/BUILD/work/raspberrypi4-webos-linux-gnueabi/luna-service2/3.21.2-6-r25/recipe-sysroot -O2 -pipe -g -feliminate-unused-debug-types -fmacro-prefix-map=/home/youngyunkim/00\_webos/20201005/build-webos/BUILD/work/raspberrypi4-webos-linux-gnueabi/luna-service2/3.21.2-6-r25=/usr/src/debug/luna-service2/3.21.2-6-r25 -fdebug-prefix-map=/home/youngyunkim/00\_webos/20201005/build-webos/BUILD/work/raspberrypi4-webos-linux-gnueabi/luna-service2/3.21.2-6-r25=/usr/src/debug/luna-service2/3.21.2-6-r25 -fdebug-prefix-map=/home/youngyunkim/00\_webos/20201005/build-webos/BUILD/work/raspberrypi4-webos-linux-gnueabi/luna-service2/3.21.2-6-r25/recipe-sysroot= -fdebug-prefix-map=/home/youngyunkim/00\_webos/20201005/build-webos/BUILD/work/raspberrypi4-webos-linux-gnueabi/luna-service2/3.21.2-6-r25/recipe-sysroot-native= -fvisibility-inlines-hidden -mthumb -mfpu=neon-vfpv4 -mfloat-abi=hard -mcpu=cortex-a7 -fstack-protector-strong -D\_FORTIFY\_SOURCE=2 -Wformat -Wformat-security -Werror=format-security -Werror=return-type --sysroot=/home/youngyunkim/00\_webos/20201005/build-webos/BUILD/work/raspberrypi4-webos-linux-gnueabi/luna-service2/3.21.2-6-r25/recipe-sysroot -DWEBOS\_TARGET\_MACHINE\_IMPL\_HARDWARE -DTARGET\_DEVICE -include /home/youngyunkim/00\_webos/20201005/build-webos/BUILD/work/raspberrypi4-webos-linux-gnueabi/luna-service2/3.21.2-6-r25/build/Configured/webospaths.h -UNDEBUG -DUSE\_PMLOG\_DECLARATION -DMEMCHECK -DLSHANDLE\_CHECK -Wall -Werror=switch -DSECURITY\_COMPATIBILITY -Wl,--no-undefined -Wall -std=c++11 -Wl,-lpbnjson\_cpp -Wl,-lpbnjson\_c -DNDEBUG -mthumb -mfpu=neon-vfpv4 -mfloat-abi=hard -mcpu=cortex-a7 -fstack-protector-strong -D\_FORTIFY\_SOURCE=2 -Wformat -Wformat-security -Werror=format-security -Werror=return-type --sysroot=/home/youngyunkim/00\_webos/20201005/build-webos/BUILD/work/raspberrypi4-webos-linux-gnueabi/luna-service2/3.21.2-6-r25/recipe-sysroot -O2 -pipe -g -feliminate-unused-debug-types -fmacro-prefix-map=/home/youngyunkim/00\_webos/20201005/build-webos/BUILD/work/raspberrypi4-webos-linux-gnueabi/luna-service2/3.21.2-6-r25=/usr/src/debug/luna-service2/3.21.2-6-r25 -fdebug-prefix-map=/home/youngyunkim/00\_webos/20201005/build-webos/BUILD/work/raspberrypi4-webos-linux-gnueabi/luna-service2/3.21.2-6-r25=/usr/src/debug/luna-service2/3.21.2-6-r25 -fdebug-prefix-map=/home/youngyunkim/00\_webos/20201005/build-webos/BUILD/work/raspberrypi4-webos-linux-gnueabi/luna-service2/3.21.2-6-r25/recipe-sysroot= -fdebug-prefix-map=/home/youngyunkim/00\_webos/20201005/build-webos/BUILD/work/raspberrypi4-webos-linux-gnueabi/luna-service2/3.21.2-6-r25/recipe-sysroot-native= -fvisibility-inlines-hidden -mthumb -mfpu=neon-vfpv4 -mfloat-abi=hard -mcpu=cortex-a7 -fstack-protector-strong -D\_FORTIFY\_SOURCE=2 -Wformat -Wformat-security -Werror=format-security -Werror=return-type --sysroot=/home/youngyunkim/00\_webos/20201005/build-webos/BUILD/work/raspberrypi4-webos-linux-gnueabi/luna-service2/3.21.2-6-r25/recipe-sysroot -Wl,-O1 -Wl,--hash-style=gnu -Wl,--as-needed -fstack-protector-strong -Wl,-z,relro,-z,now -Wl,-O1 -Wl,--hash-style=gnu -Wl,--as-needed -fstack-protector-strong -Wl,-z,relro,-z,now -rdynamic src/libluna-service2++/test/CMakeFiles/test\_category.dir/test\_category.cpp.o -o src/libluna-service2++/test/test\_category -Wl,-rpath,"$ORIGIN/../:$ORIGIN/../../libluna-service2:" src/libluna-service2++/libluna-service2++.so.3.21.2 lib/libgtest.a lib/libgtest\_main.a src/libluna-service2/libluna-service2.so.3.21.2 -lglib-2.0 -lPmLogLib -ldl -lpthread -lrt -lpbnjson\_cpp -lpbnjson\_c lib/libgtest.a -lpthread && :  
> _/usr/src/debug/luna-service2/3.21.2-6-r25/git/src/libluna-service2++/test/test\_category.cpp:200: error: undefined reference to 'testing::internal::ScopedTrace::ScopedTrace(char const, int, testing::Message const&)'_\*  
> **\> /usr/src/debug/luna-service2/3.21.2-6-r25/git/src/libluna-service2++/test/test\_category.cpp:200: error: undefined reference to 'testing::internal::ScopedTrace::~ScopedTrace()'**  
> _\> /usr/src/debug/luna-service2/3.21.2-6-r25/git/src/libluna-service2++/test/test\_category.cpp:215: error: undefined reference to 'testing::internal::ScopedTrace::ScopedTrace(char const, int, testing::Message const&)'_\*  
> **\> /usr/src/debug/luna-service2/3.21.2-6-r25/git/src/libluna-service2++/test/test\_category.cpp:215: error: undefined reference to 'testing::internal::ScopedTrace::~ScopedTrace()'**  
> **\> /usr/src/debug/luna-service2/3.21.2-6-r25/git/src/libluna-service2++/test/test\_category.cpp:200: error: undefined reference to 'testing::internal::ScopedTrace::~ScopedTrace()'**  
> **\> /usr/src/debug/luna-service2/3.21.2-6-r25/git/src/libluna-service2++/test/test\_category.cpp:215: error: undefined reference to 'testing::internal::ScopedTrace::~ScopedTrace()'**  
> _\> /usr/src/debug/luna-service2/3.21.2-6-r25/git/src/libluna-service2++/test/test\_category.cpp:559: error: undefined reference to 'testing::internal::ScopedTrace::ScopedTrace(char const, int, testing::Message const&)'_\*  
> _\> /usr/src/debug/luna-service2/3.21.2-6-r25/git/src/libluna-service2++/test/test\_category.cpp:597: error: undefined reference to 'testing::internal::ScopedTrace::ScopedTrace(char const, int, testing::Message const&)'_\*  
> **\> collect2: error: ld returned 1 exit status**  
> **\> [99/275]**  
> /home/youngyunkim/00\_webos/20201005/build-webos/BUILD/work/raspberrypi4-webos-linux-gnueabi/luna-service2/3.21.2-6-r25/recipe-sysroot-native/usr/bin/arm-webos-linux-gnueabi/arm-webos-linux-gnueabi-g++ -I/home/youngyunkim/00\_webos/20201005/build-webos/BUILD/work/raspberrypi4-webos-linux-gnueabi/luna-service2/3.21.2-6-r25/git/src/libluna-service2 -I/home/youngyunkim/00\_webos/20201005/build-webos/BUILD/work/raspberrypi4-webos-linux-gnueabi/luna-service2/3.21.2-6-r25/git/include/public -I/home/youngyunkim/00\_webos/20201005/build-webos/BUILD/work/raspberrypi4-webos-linux-gnueabi/luna-service2/3.21.2-6-r25/git/include/private -I/home/youngyunkim/00\_webos/20201005/build-webos/BUILD/work/raspberrypi4-webos-linux-gnueabi/luna-service2/3.21.2-6-r25/recipe-sysroot/usr/include/glib-2.0 -I/home/youngyunkim/00\_webos/20201005/build-webos/BUILD/work/raspberrypi4-webos-linux-gnueabi/luna-service2/3.21.2-6-r25/recipe-sysroot/usr/lib/glib-2.0/include -I/home/youngyunkim/00\_webos/20201005/build-webos/BUILD/work/raspberrypi4-webos-linux-gnueabi/luna-service2/3.21.2-6-r25/git/include/private/tests -I/usr/src/gtest/include -I/home/youngyunkim/00\_webos/20201005/build-webos/BUILD/work/raspberrypi4-webos-linux-gnueabi/luna-service2/3.21.2-6-r25/git/include/public/luna-service2++ -isystem /home/youngyunkim/00\_webos/20201005/build-webos/BUILD/work/raspberrypi4-webos-linux-gnueabi/luna-service2/3.21.2-6-r25/recipe-sysroot/usr/src/gtest/include -isystem /home/youngyunkim/00\_webos/20201005/build-webos/BUILD/work/raspberrypi4-webos-linux-gnueabi/luna-service2/3.21.2-6-r25/recipe-sysroot/usr/src/gtest -mthumb -mfpu=neon-vfpv4 -mfloat-abi=hard -mcpu=cortex-a7 -fstack-protector-strong -D\_FORTIFY\_SOURCE=2 -Wformat -Wformat-security -Werror=format-security -Werror=return-type --sysroot=/home/youngyunkim/00\_webos/20201005/build-webos/BUILD/work/raspberrypi4-webos-linux-gnueabi/luna-service2/3.21.2-6-r25/recipe-sysroot -O2 -pipe -g -feliminate-unused-debug-types -fmacro-prefix-map=/home/youngyunkim/00\_webos/20201005/build-webos/BUILD/work/raspberrypi4-webos-linux-gnueabi/luna-service2/3.21.2-6-r25=/usr/src/debug/luna-service2/3.21.2-6-r25 -fdebug-prefix-map=/home/youngyunkim/00\_webos/20201005/build-webos/BUILD/work/raspberrypi4-webos-linux-gnueabi/luna-service2/3.21.2-6-r25=/usr/src/debug/luna-service2/3.21.2-6-r25 -fdebug-prefix-map=/home/youngyunkim/00\_webos/20201005/build-webos/BUILD/work/raspberrypi4-webos-linux-gnueabi/luna-service2/3.21.2-6-r25/recipe-sysroot= -fdebug-prefix-map=/home/youngyunkim/00\_webos/20201005/build-webos/BUILD/work/raspberrypi4-webos-linux-gnueabi/luna-service2/3.21.2-6-r25/recipe-sysroot-native= -fvisibility-inlines-hidden -mthumb -mfpu=neon-vfpv4 -mfloat-abi=hard -mcpu=cortex-a7 -fstack-protector-strong -D\_FORTIFY\_SOURCE=2 -Wformat -Wformat-security -Werror=format-security -Werror=return-type --sysroot=/home/youngyunkim/00\_webos/20201005/build-webos/BUILD/work/raspberrypi4-webos-linux-gnueabi/luna-service2/3.21.2-6-r25/recipe-sysroot -DWEBOS\_TARGET\_MACHINE\_IMPL\_HARDWARE -DTARGET\_DEVICE -include /home/youngyunkim/00\_webos/20201005/build-webos/BUILD/work/raspberrypi4-webos-linux-gnueabi/luna-service2/3.21.2-6-r25/build/Configured/webospaths.h -UNDEBUG -DUSE\_PMLOG\_DECLARATION -DMEMCHECK -DLSHANDLE\_CHECK -Wall -Werror=switch -DSECURITY\_COMPATIBILITY -Wl,--no-undefined -Wall -std=c++11 -Wl,-lpbnjson\_cpp -Wl,-lpbnjson\_c -DNDEBUG -DLS\_SCHEMA\_ROOT="/home/youngyunkim/00\_webos/20201005/build-webos/BUILD/work/raspberrypi4-webos-linux-gnueabi/luna-service2/3.21.2-6-r25/git/files/schema" -MD -MT src/libluna-service2++/test/CMakeFiles/test\_jsonpayload.dir/test\_jsonpayload.cpp.o -MF src/libluna-service2++/test/CMakeFiles/test\_jsonpayload.dir/test\_jsonpayload.cpp.o.d -o src/libluna-service2++/test/CMakeFiles/test\_jsonpayload.dir/test\_jsonpayload.cpp.o -c /home/youngyunkim/00\_webos/20201005/build-webos/BUILD/work/raspberrypi4-webos-linux-gnueabi/luna-service2/3.21.2-6-r25/git/src/libluna-service2++/test/test\_jsonpayload.cpp  
> [100/275] /home/youngyunkim/00\_webos/20201005/build-webos/BUILD/work/raspberrypi4-webos-linux-gnueabi/luna-service2/3.21.2-6-r25/recipe-sysroot-native/usr/bin/arm-webos-linux-gnueabi/arm-webos-linux-gnueabi-g++ -I/home/youngyunkim/00\_webos/20201005/build-webos/BUILD/work/raspberrypi4-webos-linux-gnueabi/luna-service2/3.21.2-6-r25/git/src/libluna-service2 -I/home/youngyunkim/00\_webos/20201005/build-webos/BUILD/work/raspberrypi4-webos-linux-gnueabi/luna-service2/3.21.2-6-r25/git/include/public -I/home/youngyunkim/00\_webos/20201005/build-webos/BUILD/work/raspberrypi4-webos-linux-gnueabi/luna-service2/3.21.2-6-r25/git/include/private -I/home/youngyunkim/00\_webos/20201005/build-webos/BUILD/work/raspberrypi4-webos-linux-gnueabi/luna-service2/3.21.2-6-r25/recipe-sysroot/usr/include/glib-2.0 -I/home/youngyunkim/00\_webos/20201005/build-webos/BUILD/work/raspberrypi4-webos-linux-gnueabi/luna-service2/3.21.2-6-r25/recipe-sysroot/usr/lib/glib-2.0/include -I/home/youngyunkim/00\_webos/20201005/build-webos/BUILD/work/raspberrypi4-webos-linux-gnueabi/luna-service2/3.21.2-6-r25/git/include/private/tests -I/usr/src/gtest/include -I/home/youngyunkim/00\_webos/20201005/build-webos/BUILD/work/raspberrypi4-webos-linux-gnueabi/luna-service2/3.21.2-6-r25/git/include/public/luna-service2++ -isystem /home/youngyunkim/00\_webos/20201005/build-webos/BUILD/work/raspberrypi4-webos-linux-gnueabi/luna-service2/3.21.2-6-r25/recipe-sysroot/usr/src/gtest/include -isystem /home/youngyunkim/00\_webos/20201005/build-webos/BUILD/work/raspberrypi4-webos-linux-gnueabi/luna-service2/3.21.2-6-r25/recipe-sysroot/usr/src/gtest -mthumb -mfpu=neon-vfpv4 -mfloat-abi=hard -mcpu=cortex-a7 -fstack-protector-strong -D\_FORTIFY\_SOURCE=2 -Wformat -Wformat-security -Werror=format-security -Werror=return-type --sysroot=/home/youngyunkim/00\_webos/20201005/build-webos/BUILD/work/raspberrypi4-webos-linux-gnueabi/luna-service2/3.21.2-6-r25/recipe-sysroot -O2 -pipe -g -feliminate-unused-debug-types -fmacro-prefix-map=/home/youngyunkim/00\_webos/20201005/build-webos/BUILD/work/raspberrypi4-webos-linux-gnueabi/luna-service2/3.21.2-6-r25=/usr/src/debug/luna-service2/3.21.2-6-r25 -fdebug-prefix-map=/home/youngyunkim/00\_webos/20201005/build-webos/BUILD/work/raspberrypi4-webos-linux-gnueabi/luna-service2/3.21.2-6-r25=/usr/src/debug/luna-service2/3.21.2-6-r25 -fdebug-prefix-map=/home/youngyunkim/00\_webos/20201005/build-webos/BUILD/work/raspberrypi4-webos-linux-gnueabi/luna-service2/3.21.2-6-r25/recipe-sysroot= -fdebug-prefix-map=/home/youngyunkim/00\_webos/20201005/build-webos/BUILD/work/raspberrypi4-webos-linux-gnueabi/luna-service2/3.21.2-6-r25/recipe-sysroot-native= -fvisibility-inlines-hidden -mthumb -mfpu=neon-vfpv4 -mfloat-abi=hard -mcpu=cortex-a7 -fstack-protector-strong -D\_FORTIFY\_SOURCE=2 -Wformat -Wformat-security -Werror=format-security -Werror=return-type --sysroot=/home/youngyunkim/00\_webos/20201005/build-webos/BUILD/work/raspberrypi4-webos-linux-gnueabi/luna-service2/3.21.2-6-r25/recipe-sysroot -DWEBOS\_TARGET\_MACHINE\_IMPL\_HARDWARE -DTARGET\_DEVICE -include /home/youngyunkim/00\_webos/20201005/build-webos/BUILD/work/raspberrypi4-webos-linux-gnueabi/luna-service2/3.21.2-6-r25/build/Configured/webospaths.h -UNDEBUG -DUSE\_PMLOG\_DECLARATION -DMEMCHECK -DLSHANDLE\_CHECK -Wall -Werror=switch -DSECURITY\_COMPATIBILITY -Wl,--no-undefined -Wall -std=c++11 -Wl,-lpbnjson\_cpp -Wl,-lpbnjson\_c -DNDEBUG -MD -MT src/libluna-service2++/test/CMakeFiles/test\_call.dir/test\_call.cpp.o -MF src/libluna-service2++/test/CMakeFiles/test\_call.dir/test\_call.cpp.o.d -o src/libluna-service2++/test/CMakeFiles/test\_call.dir/test\_call.cpp.o -c /home/youngyunkim/00\_webos/20201005/build-webos/BUILD/work/raspberrypi4-webos-linux-gnueabi/luna-service2/3.21.2-6-r25/git/src/libluna-service2++/test/test\_call.cpp  
> [101/275] /home/youngyunkim/00\_webos/20201005/build-webos/BUILD/work/raspberrypi4-webos-linux-gnueabi/luna-service2/3.21.2-6-r25/recipe-sysroot-native/usr/bin/arm-webos-linux-gnueabi/arm-webos-linux-gnueabi-g++ -I/home/youngyunkim/00\_webos/20201005/build-webos/BUILD/work/raspberrypi4-webos-linux-gnueabi/luna-service2/3.21.2-6-r25/git/src/libluna-service2 -I/home/youngyunkim/00\_webos/20201005/build-webos/BUILD/work/raspberrypi4-webos-linux-gnueabi/luna-service2/3.21.2-6-r25/git/include/public -I/home/youngyunkim/00\_webos/20201005/build-webos/BUILD/work/raspberrypi4-webos-linux-gnueabi/luna-service2/3.21.2-6-r25/git/include/private -I/home/youngyunkim/00\_webos/20201005/build-webos/BUILD/work/raspberrypi4-webos-linux-gnueabi/luna-service2/3.21.2-6-r25/recipe-sysroot/usr/include/glib-2.0 -I/home/youngyunkim/00\_webos/20201005/build-webos/BUILD/work/raspberrypi4-webos-linux-gnueabi/luna-service2/3.21.2-6-r25/recipe-sysroot/usr/lib/glib-2.0/include -I/home/youngyunkim/00\_webos/20201005/build-webos/BUILD/work/raspberrypi4-webos-linux-gnueabi/luna-service2/3.21.2-6-r25/git/include/private/tests -I/usr/src/gtest/include -I/home/youngyunkim/00\_webos/20201005/build-webos/BUILD/work/raspberrypi4-webos-linux-gnueabi/luna-service2/3.21.2-6-r25/git/include/public/luna-service2++ -isystem /home/youngyunkim/00\_webos/20201005/build-webos/BUILD/work/raspberrypi4-webos-linux-gnueabi/luna-service2/3.21.2-6-r25/recipe-sysroot/usr/src/gtest/include -isystem /home/youngyunkim/00\_webos/20201005/build-webos/BUILD/work/raspberrypi4-webos-linux-gnueabi/luna-service2/3.21.2-6-r25/recipe-sysroot/usr/src/gtest -mthumb -mfpu=neon-vfpv4 -mfloat-abi=hard -mcpu=cortex-a7 -fstack-protector-strong -D\_FORTIFY\_SOURCE=2 -Wformat -Wformat-security -Werror=format-security -Werror=return-type --sysroot=/home/youngyunkim/00\_webos/20201005/build-webos/BUILD/work/raspberrypi4-webos-linux-gnueabi/luna-service2/3.21.2-6-r25/recipe-sysroot -O2 -pipe -g -feliminate-unused-debug-types -fmacro-prefix-map=/home/youngyunkim/00\_webos/20201005/build-webos/BUILD/work/raspberrypi4-webos-linux-gnueabi/luna-service2/3.21.2-6-r25=/usr/src/debug/luna-service2/3.21.2-6-r25 -fdebug-prefix-map=/home/youngyunkim/00\_webos/20201005/build-webos/BUILD/work/raspberrypi4-webos-linux-gnueabi/luna-service2/3.21.2-6-r25=/usr/src/debug/luna-service2/3.21.2-6-r25 -fdebug-prefix-map=/home/youngyunkim/00\_webos/20201005/build-webos/BUILD/work/raspberrypi4-webos-linux-gnueabi/luna-service2/3.21.2-6-r25/recipe-sysroot= -fdebug-prefix-map=/home/youngyunkim/00\_webos/20201005/build-webos/BUILD/work/raspberrypi4-webos-linux-gnueabi/luna-service2/3.21.2-6-r25/recipe-sysroot-native= -fvisibility-inlines-hidden -mthumb -mfpu=neon-vfpv4 -mfloat-abi=hard -mcpu=cortex-a7 -fstack-protector-strong -D\_FORTIFY\_SOURCE=2 -Wformat -Wformat-security -Werror=format-security -Werror=return-type --sysroot=/home/youngyunkim/00\_webos/20201005/build-webos/BUILD/work/raspberrypi4-webos-linux-gnueabi/luna-service2/3.21.2-6-r25/recipe-sysroot -DWEBOS\_TARGET\_MACHINE\_IMPL\_HARDWARE -DTARGET\_DEVICE -include /home/youngyunkim/00\_webos/20201005/build-webos/BUILD/work/raspberrypi4-webos-linux-gnueabi/luna-service2/3.21.2-6-r25/build/Configured/webospaths.h -UNDEBUG -DUSE\_PMLOG\_DECLARATION -DMEMCHECK -DLSHANDLE\_CHECK -Wall -Werror=switch -DSECURITY\_COMPATIBILITY -Wl,--no-undefined -Wall -std=c++11 -Wl,-lpbnjson\_cpp -Wl,-lpbnjson\_c -DNDEBUG -MD -MT src/libluna-service2++/test/CMakeFiles/test\_subscription\_cxx.dir/test\_subscription\_cxx.cpp.o -MF src/libluna-service2++/test/CMakeFiles/test\_subscription\_cxx.dir/test\_subscription\_cxx.cpp.o.d -o src/libluna-service2++/test/CMakeFiles/test\_subscription\_cxx.dir/test\_subscription\_cxx.cpp.o -c /home/youngyunkim/00\_webos/20201005/build-webos/BUILD/work/raspberrypi4-webos-linux-gnueabi/luna-service2/3.21.2-6-r25/git/src/libluna-service2++/test/test\_subscription\_cxx.cpp  
> ninja: build stopped: subcommand failed.  
> WARNING: exit code 1 from a shell command.

---

<div class="post-metadata">

**Author:** ![youngyun](https://yyz1.discourse-cdn.com/flex031/user_avatar/forum.webosose.org/youngyun/32/377_2.png) [@youngyun](https://forum.webosose.org/u/youngyun)\
**Post date:** [October 5, 2020, 6:18am UTC](https://forum.webosose.org/t/build-failed-webos-ose-2-7-0/1221/2 "2020-10-05T06:18:40Z")

</div>

Temporarily, I comment out below lines.

 ![image](https://canada1.discourse-cdn.com/flex031/uploads/developer1/original/1X/d89035de68c1831ce83327ea6d8b890ac7f9d1d5.png)

There seems to be some problems with macro, SCOPED\_TRACE.

---

<div class="post-metadata">

**Author:** ![NERGI](https://yyz1.discourse-cdn.com/flex031/user_avatar/forum.webosose.org/nergi/32/364_2.png) [@NERGI](https://forum.webosose.org/u/NERGI)\
**Post date:** [October 8, 2020, 5:05am UTC](https://forum.webosose.org/t/build-failed-webos-ose-2-7-0/1221/3 "2020-10-08T05:05:46Z")

</div>

Hi @youngyun,

Could you build again with lower value for `mcf` command?  
If you assign too high values to `-p` and `-b` options, it might cause unexpected build errors when you execute the `make` command.

Thanks,

---

<div class="post-metadata">

**Author:** ![NERGI](https://yyz1.discourse-cdn.com/flex031/user_avatar/forum.webosose.org/nergi/32/364_2.png) [@NERGI](https://forum.webosose.org/u/NERGI)\
**Post date:** [October 13, 2020, 2:30am UTC](https://forum.webosose.org/t/build-failed-webos-ose-2-7-0/1221/4 "2020-10-13T02:30:11Z")

</div>

Hi @youngyun,

You may see a build error related to `Ostree-kernel-initramfs`.  
In that case, please refer to [[Notice] Build issue related to webOS OSE 2.7.0](https://forum.webosose.org/t/notice-build-issue-related-to-webos-ose-2-7-0/1231).

Thanks
